{"text_format":"1","workbook":"xlsx","n_sheets":4,"sheets":["Welcome","Dashboard","Assessment","Table References"],"not_rendered":{"charts":0,"images":0,"macros":1,"external_links":1,"defined_names":1,"comments":0,"pivot_tables":0},"unopened":[],"bounds":{"document_bytes":16777216,"sheet_cells":100000,"rows_first":2000,"rows_last":500,"rows_between":2000,"halvings":0,"cell_chars":16384,"cell_head_chars":4096},"cells_cut":0,"cells_raw":0,"read":"whole","date_system":"1900"}

{"sheet":"Welcome","index":0,"n_rows":25,"n_cols":4,"rows_kept":25,"cut":false,"hidden":false,"merged":[[15,1,15,9],[14,1,14,9],[13,1,13,9],[0,0,0,3],[5,0,5,9],[9,0,9,9]]}
["NIST 800-171 Control Evaluation Spreadsheet"]
[null,null,"Version 1.0"]
[]
["Introduction"]
[]
["The NIST 800-171 Control Evaluation Spreadsheet supports colleges and universities in their efforts to comply with the NIST standard, prioritize information security efforts, and provide metrics for reporting.  It is free to use and requires no permission.  All questions should be directed to EDUCAUSE Working Groups."]
[]
["Basic Instructions"]
[]
["All of the working should be done on the Assessment table. Using the dropdowns, select your current state of completion, the priority to the institution, and any inhibitors to completion. Once selected, these items will be totaled on the Dashboard and Table References tabs. The columns for Tags and Notes are for the institution to use to support efforts or reporting as needed. The source tables for the dropdowns can be found on the Assessment tab in N1 through U11. Definitions of fields can be found on the Table References tab.\nAny time you need to update a cell value in the Assessment tab, you must first delete the existing value (otherwise the cell will show multiple values). When you need to clear a field, please use the Clear Contents command (in the Editing menu) for best results.\nIf you have a control that has been completed, there should be no inhibitors listed for that item.\nYou may have more than on inhibitor per control.\nAlways be consistent in how you answer questions for the best results."]
[]
["Notices"]
[]
[1,"The workbook is intended to be shared and/or modified to fit your organization. It was created by EDUCAUSE for general use and should not be sold or monetized."]
[2,"For full functionality, macros need to be enabled for the spreadsheet."]
[3,"This workbook is to support organizational efforts to improve cybersecurity stance.  It is not a substitute for a professional audit and not to be considered comprehensive or authoritative."]
[]
["References"]
[]
["Protecting CUI in Nonfederal Systems and Organizations",null,null,"https://csrc.nist.gov/publications/detail/sp/800-171/rev-2/final"]
["NIST 800-171 Compliance Template",null,null,"https://library.educause.edu/resources/2016/9/nist-sp-800-171-compliance-template"]
["NIST Spec Pub. 800-171A (Assessing Security Requirements for CUI)",null,null,"https://nvlpubs.nist.gov/nistpubs/SpecialPublications/NIST.SP.800-171A.pdf"]
["Cybersecurity Maturity Model Certification (CMMC) 2.0",null,null,"https://www.federalregister.gov/documents/2021/11/17/2021-24880/cybersecurity-maturity-model-certification-cmmc-20-updates-and-way-forward"]
["NIST SP 800-171 DoD Assessment Mythology, Version 1.2.1",null,null,"https://www.acq.osd.mil/asda/dpc/cp/cyber/docs/safeguarding/NIST-SP-800-171-Assessment-Methodology-Version-1.2.1-6.24.2020.pdf"]
["Sample NIST SP 800-171 DoD Assessment Score Report",null,null,"https://www.rapidfiretools.com/reports/compliance-manager/CMMC/NIST_SP_800_171_DoD_Assessment_Score_Report.pdf"]

{"sheet":"Dashboard","index":1,"n_rows":30,"n_cols":5,"rows_kept":30,"cut":false,"hidden":false,"merged":[]}
[null,"DASHBOARD"]
[]
[null,"Family","Alignment (pts.)","Possible","Alignment (per.)"]
[3.1,"Access Control",{"$f":"'Table References'!B45","v":1.5},22,{"$f":"(C4/D4)","v":6.8181818181818177E-2}]
[3.2,"Awareness and Training",{"$f":"'Table References'!C45","v":0},3,{"$f":"(C5/D5)","v":0}]
[3.3,"Audit and Accountability",{"$f":"'Table References'!D45","v":0},9,0]
[3.4,"Configuration Management",{"$f":"'Table References'!F45","v":0},9,0]
[3.5,"Identification and Authentication",{"$f":"'Table References'!G45","v":0},11,0]
[3.6,"Incident Response",{"$f":"'Table References'!H45","v":0},3,0]
[3.7,"Maintenance",{"$f":"'Table References'!I45","v":0},6,0]
[3.8,"Media Protection",{"$f":"'Table References'!J45","v":0},9,0]
[3.9,"Personnel Security",{"$f":"'Table References'!K45","v":0},2,0]
[3.1,"Physical Protection",{"$f":"'Table References'!L45","v":0},6,0]
[3.11,"Risk Assessment",{"$f":"'Table References'!M45","v":0},3,0]
[3.12,"Security Assessment",{"$f":"'Table References'!N45","v":0},4,0]
[3.13,"System and Communications Protection",{"$f":"'Table References'!N45","v":0},16,0]
[3.14,"System and Information Integrity",{"$f":"'Table References'!O45","v":1},7,0.14285714285714285]
[null,"Overall Alignment",{"$f":"SUM(C4:C17)","v":2.5},{"$f":"SUM(D4:D17)","v":110},2.2727272727272728E-2]
[]
[]
["Summary of Inhibitors for the Enterprise",null,"#","%"]
["Complex Infrastructure",null,{"$f":"COUNTIF(Assessment!H1:'Assessment'!H422,\"*Complex Infrastructure*\")","v":1},{"$f":"C22/$C$30","v":0.2}]
["Complex Political Issues",null,{"$f":"COUNTIF(Assessment!H1:'Assessment'!H422,\"*Comples Political Issues*\")","v":0},0]
["Complex Processes",null,{"$f":"COUNTIF(Assessment!H1:'Assessment'!H422,\"*Complex Processes*\")","v":1},0.2]
["Financial Constraints",null,{"$f":"COUNTIF(Assessment!H1:'Assessment'!H422,\"*Financial Constraints*\")","v":0},0]
["Human Resource Constraints",null,{"$f":"COUNTIF(Assessment!H1:'Assessment'!H422,\"*Human Resource Constraints*\")","v":2},0.4]
["Knowledge Gaps",null,{"$f":"COUNTIF(Assessment!H1:'Assessment'!H422,\"*Knowledge Gaps*\")","v":0},0]
["Project Procedural Issues",null,{"$f":"COUNTIF(Assessment!H1:'Assessment'!H425,\"*Project Procedural Issues*\")","v":0},0]
["Time Constraints",null,{"$f":"COUNTIF(Assessment!H1:'Assessment'!H422,\"*Complex Infrastructure*\")","v":1},0.2]
[null,null,{"$f":"SUM(C22:C29)","v":5},{"$f":"SUM(D22:D29)","v":1}]

{"sheet":"Assessment","index":2,"n_rows":422,"n_cols":21,"rows_kept":422,"cut":false,"hidden":false,"merged":[[1,15,1,16],[1,18,1,20]]}
["Family Num.","Family Sub Num.","Assessment Obj.","Control Family","Current State","DoD Score","Priority","Inhibitors","TAGS","Notes"]
[3.1,null,null,"Access Control",null,null,null,null,null,null,null,null,null,"Inhibitors",null,"Priority",null,null,"Current State"]
[null,"3.1.1",null,"Limit system access to authorized users, processes acting on behalf of authorized users, and devices (including other systems).",1,5,"Low","Human Resource Constraints, Complex Processes",null,null,null,null,null,null,null,"Code","Color",null,"Status","Color","Num Value"]
[null,null,"3.1.1[a]","Authorized users are identified.",null,null,null,null,null,null,null,null,null,"Complex Infrastructure",null,"Low","Yellow",null,"N/A",null,0]
[null,null,"3.1.1[b]","Security risks associated with organizational activities involving CUI are identified. ",null,null,null,null,null,null,null,null,null,"Complex Political Issues",null,"Med","Orange",null,"Not started","Red",0]
[null,null,"3.1.1[c]","Devices (and other systems) authorized to connect to the system are identified. ",null,null,null,null,null,null,null,null,null,"Complex Processes",null,"High","Red",null,0.25,"Red",0]
[null,null,"3.1.1[d]","System access is limited to authorized users.",null,null,null,null,null,null,null,null,null,"Financial Constraints",null,null,null,null,0.5,"Yellow",0.5]
[null,null,"3.1.1[e]","System access is limited to processes acting on behalf of authorized users. ",null,null,null,null,null,null,null,null,null,"Human Resource Constraints",null,null,null,null,0.75,"Yellow",0.5]
[null,null,"3.1.1[f]","System access is limited to authorized devices (including other systems). ",null,null,null,null,null,null,null,null,null,"Knowledge Gaps",null,null,null,null,1,"Green",1]
[null,"3.1.2",null,"Limit system access to the types of transactions and functions that authorized users are permitted to execute.","N/A",5,"Med",null,null,null,null,null,null,"Project Procedural Issues"]
[null,null,"3.1.2[a]","The types of transactions and functions that authorized users are permitted to execute are defined. ",null,null,null,null,null,null,null,null,null,"Time Constraints",null,"Color is the conditional formatting used when the dropdown code/status is selected."]
[null,null,"3.1.2[b]","System access is limited to the defined types of transactions and functions for authorized users."]
[null,"3.1.3",null,"Control the flow of CUI in accordance with approved authorizations.","Not started",1,"High"]
[null,null,"3.1.3[a]","Information flow control policies are defined. "]
[null,null,"3.1.3[b]","Methods and enforcement mechanisms for controlling the flow of CUI are defined. "]
[null,null,"3.1.3[c]","Designated sources and destinations (e.g., networks, individuals, and devices) for CUI within the system and between interconnected systems are identified. "]
[null,null,"3.1.3[d]","Authorizations for controlling the flow of CUI are defined."]
[null,null,"3.1.3[e]","Approved authorizations for controlling the flow of CUI are enforced. "]
[null,"3.1.4",null,"Separate the duties of individuals to reduce the risk of malevolent activity without collusion. ",0.5,1]
[null,null,"3.1.4[a]","The duties of individuals requiring separation are defined."]
[null,null,"3.1.4[b]","Responsibilities for duties that require separation are assigned to separate individuals. "]
[null,null,"3.1.4[c]","Access privileges that enable individuals to exercise the duties that require separation are granted to separate individuals."]
[null,"3.1.5",null,"Employ the principle of least privilege, including for specific security functions and privileged accounts. ",0.25,3]
[null,null,"3.1.5[a]","Privileged accounts are identified."]
[null,null,"3.1.5[b]","Access to privileged accounts is authorized in accordance with the principle of least privilege. "]
[null,null,"3.1.5[c]","Security functions are identified."]
[null,null,"3.1.5[d]","Access to security functions is authorized in accordance with the principle of least privilege. "]
[null,"3.1.6",null,"Use non-privileged accounts or roles when accessing nonsecurity functions. ",null,1]
[null,null,"3.1.6[a]","Nonsecurity functions are identified. "]
[null,null,"3.1.6[b]","Users are required to use non-privileged accounts or roles when accessing nonsecurity functions. "]
[null,"3.1.7",null,"Prevent non-privileged users from executing privileged functions and capture the execution of such functions in audit logs. ",null,1]
[null,null,"3.1.7[a]","Privileged functions are defined. "]
[null,null,"3.1.7[b]","Non-privileged users are defined."]
[null,null,"3.1.7[c]","Bon-privileged users are prevented from executing privileged functions."]
[null,null,"3.1.7[d]","The execution of privileged functions is captured in audit logs. "]
[null,"3.1.8",null,"Limit unsuccessful logon attempts.",null,1]
[null,null,"3.1.8[a]","The means of limiting unsuccessful logon attempts is defined."]
[null,null,"3.1.8[b]","The defined means of limiting unsuccessful logon attempts is implemented."]
[null,"3.1.9",null,"Provide privacy and security notices consistent with applicable CUI rules.",null,1]
[null,null,"3.1.9[a]","Privacy and security notices required by CUI-specified rules are identified, consistent, and associated with the specific CUI category. "]
{"$rows_left_out":383}
{"sheet":"Table References","index":3,"n_rows":45,"n_cols":15,"rows_kept":45,"cut":false,"hidden":false,"merged":[[13,4,13,14],[14,0,14,3],[15,0,15,3],[10,4,10,14],[6,0,6,2],[6,3,6,14],[11,4,11,14],[12,4,12,14],[0,0,0,2],[1,0,1,2],[2,0,2,2],[16,0,16,3],[4,0,4,2],[5,0,5,2],[5,3,5,14],[9,0,9,3],[10,0,10,3],[11,0,11,3],[12,0,12,3],[13,0,13,3],[14,4,14,14],[15,4,15,14],[16,4,16,14],[9,4,9,14],[3,0,3,2],[1,3,1,14],[2,3,2,14],[3,3,3,14],[4,3,4,14]]}
["Field Definitions"]
["Current State",null,null,"The current state of the control as assessed by the organization"]
["DoD Score",null,null,"Static score assigned to item by DoD for evaluating total level of compliance"]
["Priority",null,null,"Priority level assigned to item by organization"]
["Inhibitors",null,null,"Items hindering the completion of a control"]
["Tags",null,null,"Keywords used to locate control with Excel search features"]
["Notes",null,null,"Use for any notes your organization may want to keep on an item"]
[]
["Inhibitors"]
["Complex Infrastructure",null,null,null,"Current infrastructure design inhibits the implementation."]
["Complex Political Issues",null,null,null,"Current political necessities inhibit implementation."]
["Complex Processes",null,null,null,"Currently processes and/or policies inhibit implementation."]
["Financial Constraints",null,null,null,"Current financial constraints inhibit the implementation."]
["Human Resource Constraints",null,null,null,"Current availability of labor inhibits implementation."]
["Knowledge Gaps",null,null,null,"Current gaps in knowledge inhibit implementation."]
["Project Procedural Issues",null,null,null,"In-process or upcoming projects are needed prior to implementation of this constraint/project."]
["Time Constraints",null,null,null,"Current schedules and time requirements inhibit implantation."]
[]
[]
["Alignment Points Table"]
["This table is for reference and manual adjustment (if needed)."]
[null,3.1,3.2,3.3,3.4,3.5,3.6,3.7,3.8,3.9,3.1,3.11,3.12,3.13,3.14]
[1,{"$f":"IF(Assessment!$E$3=1,1,IF(Assessment!$E$3=0.5,0.5,IF(Assessment!$E$3=0.75,0.5,0)))","v":1},{"$f":"IF(Assessment!$E$96=1,1,IF(Assessment!$E$96=0.5,0.5,IF(Assessment!$E$96=0.75,0.5,0)))","v":0},{"$f":"IF(Assessment!$E$109=1,1,IF(Assessment!$E$109=0.5,0.5,IF(Assessment!$E$109=0.75,0.5,0)))","v":0},{"$f":"IF(Assessment!$E$148=1,1,IF(Assessment!$E$148=0.5,0.5,IF(Assessment!$E$148=0.75,0.5,0)))","v":0},{"$f":"IF(Assessment!$E$201=1,1,IF(Assessment!$E$201=0.5,0.5,IF(Assessment!$E$201=0.75,0.5,0)))","v":0},{"$f":"IF(Assessment!$E$235=1,1,IF(Assessment!$E$235=0.5,0.5,IF(Assessment!$E$235=0.75,0.5,0)))","v":0},{"$f":"IF(Assessment!$E$252=1,1,IF(Assessment!$E$252=0.5,0.5,IF(Assessment!$E$252=0.75,0.5,0)))","v":0},{"$f":"IF(Assessment!$E$265=1,1,IF(Assessment!$E$265=0.5,0.5,IF(Assessment!$E$265=0.75,0.5,0)))","v":0},{"$f":"IF(Assessment!$E$285=1,1,IF(Assessment!$E$285=0.5,0.5,IF(Assessment!$E$285=0.75,0.5,0)))","v":0},{"$f":"IF(Assessment!$E$291=1,1,IF(Assessment!$E$291=0.5,0.5,IF(Assessment!$E$291=0.75,0.5,0)))","v":0},{"$f":"IF(Assessment!$E$313=1,1,IF(Assessment!$E$313=0.5,0.5,IF(Assessment!$E$313=0.75,0.5,0)))","v":0},{"$f":"IF(Assessment!$E$326=1,1,IF(Assessment!$E$326=0.5,0.5,IF(Assessment!$E$326=0.75,0.5,0)))","v":0},{"$f":"IF(Assessment!$E$344=1,1,IF(Assessment!$E$344=0.5,0.5,IF(Assessment!$E$344=0.75,0.5,0)))","v":0},{"$f":"IF(Assessment!$E$397=1,1,IF(Assessment!$E$397=0.5,0.5,IF(Assessment!$E$397=0.75,0.5,0)))","v":1}]
[2,{"$f":"IF(Assessment!$E$10=1,1,IF(Assessment!$E$10=0.5,0.5,IF(Assessment!$E$10=0.75,0.5,0)))","v":0},{"$f":"IF(Assessment!$E$101=1,1,IF(Assessment!$E$101=0.5,0.5,IF(Assessment!$E$101=0.75,0.5,0)))","v":0},{"$f":"IF(Assessment!$E$116=1,1,IF(Assessment!$E$116=0.5,0.5,IF(Assessment!$E$116=0.75,0.5,0)))","v":0},{"$f":"IF(Assessment!$E$155=1,1,IF(Assessment!$E$155=0.5,0.5,IF(Assessment!$E$155=0.75,0.5,0)))","v":0},{"$f":"IF(Assessment!$E$205=1,1,IF(Assessment!$E$205=0.5,0.5,IF(Assessment!$E$205=0.75,0.5,0)))","v":0},{"$f":"IF(Assessment!$E$243=1,1,IF(Assessment!$E$243=0.5,0.5,IF(Assessment!$E$243=0.75,0.5,0)))","v":0},{"$f":"IF(Assessment!$E$253=1,1,IF(Assessment!$E$253=0.5,0.5,IF(Assessment!$E$253=0.75,0.5,0)))","v":0},{"$f":"IF(Assessment!$E$270=1,1,IF(Assessment!$E$270=0.5,0.5,IF(Assessment!$E$270=0.75,0.5,0)))","v":0},{"$f":"IF(Assessment!$E$286=1,1,IF(Assessment!$E$286=0.5,0.5,IF(Assessment!$E$286=0.75,0.5,0)))","v":0},{"$f":"IF(Assessment!$E$296=1,1,IF(Assessment!$E$296=0.5,0.5,IF(Assessment!$E$296=0.75,0.5,0)))","v":0},{"$f":"IF(Assessment!$E$316=1,1,IF(Assessment!$E$316=0.5,0.5,IF(Assessment!$E$316=0.75,0.5,0)))","v":0},{"$f":"IF(Assessment!$E$329=1,1,IF(Assessment!$E$329=0.5,0.5,IF(Assessment!$E$329=0.75,0.5,0)))","v":0},{"$f":"IF(Assessment!$E$353=1,1,IF(Assessment!$E$353=0.5,0.5,IF(Assessment!$E$353=0.75,0.5,0)))","v":0},{"$f":"IF(Assessment!$E$404=1,1,IF(Assessment!$E$404=0.5,0.5,IF(Assessment!$E$404=0.75,0.5,0)))","v":0}]
[3,{"$f":"IF(Assessment!$E$13=1,1,IF(Assessment!$E$13=0.5,0.5,IF(Assessment!$E$13=0.75,0.5,0)))","v":0},{"$f":"IF(Assessment!$E$105=1,1,IF(Assessment!$E$105=0.5,0.5,IF(Assessment!$E$105=0.75,0.5,0)))","v":0},{"$f":"IF(Assessment!$E$119=1,1,IF(Assessment!$E$119=0.5,0.5,IF(Assessment!$E$119=0.75,0.5,0)))","v":0},{"$f":"IF(Assessment!$E$158=1,1,IF(Assessment!$E$158=0.5,0.5,IF(Assessment!$E$158=0.75,0.5,0)))","v":0},{"$f":"IF(Assessment!$E$209=1,1,IF(Assessment!$E$209=0.5,0.5,IF(Assessment!$E$209=0.75,0.5,0)))","v":0},{"$f":"IF(Assessment!$E$250=1,1,IF(Assessment!$E$250=0.5,0.5,IF(Assessment!$E$250=0.75,0.5,0)))","v":0},{"$f":"IF(Assessment!$E$258=1,1,IF(Assessment!$E$258=0.5,0.5,IF(Assessment!$E$258=0.75,0.5,0)))","v":0},{"$f":"IF(Assessment!$E$271=1,1,IF(Assessment!$E$271=0.5,0.5,IF(Assessment!$E$271=0.75,0.5,0)))","v":0},null,{"$f":"IF(Assessment!$E$301=1,1,IF(Assessment!$E$301=0.5,0.5,IF(Assessment!$E$301=0.75,0.5,0)))","v":0},{"$f":"IF(Assessment!$E$322=1,1,IF(Assessment!$E$322=0.5,0.5,IF(Assessment!$E$322=0.75,0.5,0)))","v":0},{"$f":"IF(Assessment!$E$333=1,1,IF(Assessment!$E$333=0.5,0.5,IF(Assessment!$E$333=0.75,0.5,0)))","v":0},{"$f":"IF(Assessment!$E$360=1,1,IF(Assessment!$E$360=0.5,0.5,IF(Assessment!$E$360=0.75,0.5,0)))","v":0},{"$f":"IF(Assessment!$E$407=1,1,IF(Assessment!$E$407=0.5,0.5,IF(Assessment!$E$407=0.75,0.5,0)))","v":0}]
[4,{"$f":"IF(Assessment!$E$19=1,1,IF(Assessment!$E$19=0.5,0.5,IF(Assessment!$E$19=0.75,0.5,0)))","v":0.5},null,{"$f":"IF(Assessment!$E$123=1,1,IF(Assessment!$E$123=0.5,0.5,IF(Assessment!$E$123=0.75,0.5,0)))","v":0},{"$f":"IF(Assessment!$E$163=1,1,IF(Assessment!$E$163=0.5,0.5,IF(Assessment!$E$163=0.75,0.5,0)))","v":0},{"$f":"IF(Assessment!$E$214=1,1,IF(Assessment!$E$214=0.5,0.5,IF(Assessment!$E$214=0.75,0.5,0)))","v":0},null,{"$f":"IF(Assessment!$E$259=1,1,IF(Assessment!$E$259=0.5,0.5,IF(Assessment!$E$259=0.75,0.5,0)))","v":0},{"$f":"IF(Assessment!$E$274=1,1,IF(Assessment!$E$274=0.5,0.5,IF(Assessment!$E$274=0.75,0.5,0)))","v":0},null,{"$f":"IF(Assessment!$E$304=1,1,IF(Assessment!$E$304=0.5,0.5,IF(Assessment!$E$304=0.75,0.5,0)))","v":0},null,{"$f":"IF(Assessment!$E$334=1,1,IF(Assessment!$E$334=0.5,0.5,IF(Assessment!$E$334=0.75,0.5,0)))","v":0},{"$f":"IF(Assessment!$E$364=1,1,IF(Assessment!$E$364=0.5,0.5,IF(Assessment!$E$364=0.75,0.5,0)))","v":0},{"$f":"IF(Assessment!$E$411=1,1,IF(Assessment!$E$411=0.5,0.5,IF(Assessment!$E$411=0.75,0.5,0)))","v":0}]
[5,{"$f":"IF(Assessment!$E$23=1,1,IF(Assessment!$E$23=0.5,0.5,IF(Assessment!$E$23=0.75,0.5,0)))","v":0},null,{"$f":"IF(Assessment!$E$127=1,1,IF(Assessment!$E$127=0.5,0.5,IF(Assessment!$E$127=0.75,0.5,0)))","v":0},{"$f":"IF(Assessment!$E$164=1,1,IF(Assessment!$E$164=0.5,0.5,IF(Assessment!$E$164=0.75,0.5,0)))","v":0},{"$f":"IF(Assessment!$E$215=1,1,IF(Assessment!$E$215=0.5,0.5,IF(Assessment!$E$215=0.75,0.5,0)))","v":0},null,{"$f":"IF(Assessment!$E$260=1,1,IF(Assessment!$E$260=0.5,0.5,IF(Assessment!$E$260=0.75,0.5,0)))","v":0},{"$f":"IF(Assessment!$E$277=1,1,IF(Assessment!$E$277=0.5,0.5,IF(Assessment!$E$277=0.75,0.5,0)))","v":0},null,{"$f":"IF(Assessment!$E$305=1,1,IF(Assessment!$E$305=0.5,0.5,IF(Assessment!$E$305=0.75,0.5,0)))","v":0},null,null,{"$f":"IF(Assessment!$E$365=1,1,IF(Assessment!$E$365=0.5,0.5,IF(Assessment!$E$365=0.75,0.5,0)))","v":0},{"$f":"IF(Assessment!$E$412=1,1,IF(Assessment!$E$412=0.5,0.5,IF(Assessment!$E$412=0.75,0.5,0)))","v":0}]
[6,{"$f":"IF(Assessment!$E$28=1,1,IF(Assessment!$E$28=0.5,0.5,IF(Assessment!$E$28=0.75,0.5,0)))","v":0},null,{"$f":"IF(Assessment!$E$130=1,1,IF(Assessment!$E$130=0.5,0.5,IF(Assessment!$E$130=0.75,0.5,0)))","v":0},{"$f":"IF(Assessment!$E$173=1,1,IF(Assessment!$E$173=0.5,0.5,IF(Assessment!$E$173=0.75,0.5,0)))","v":0},{"$f":"IF(Assessment!$E$218=1,1,IF(Assessment!$E$218=0.5,0.5,IF(Assessment!$E$218=0.75,0.5,0)))","v":0},null,{"$f":"IF(Assessment!$E$263=1,1,IF(Assessment!$E$263=0.5,0.5,IF(Assessment!$E$263=0.75,0.5,0)))","v":0},{"$f":"IF(Assessment!$E$280=1,1,IF(Assessment!$E$280=0.5,0.5,IF(Assessment!$E$280=0.75,0.5,0)))","v":0},null,{"$f":"IF(Assessment!$E$309=1,1,IF(Assessment!$E$309=0.5,0.5,IF(Assessment!$E$309=0.75,0.5,0)))","v":0},null,null,{"$f":"IF(Assessment!$E$368=1,1,IF(Assessment!$E$368=0.5,0.5,IF(Assessment!$E$368=0.75,0.5,0)))","v":0},{"$f":"IF(Assessment!$E$416=1,1,IF(Assessment!$E$416=0.5,0.5,IF(Assessment!$E$416=0.75,0.5,0)))","v":0}]
[7,{"$f":"IF(Assessment!$E$31=1,1,IF(Assessment!$E$31=0.5,0.5,IF(Assessment!$E$31=0.75,0.5,0)))","v":0},null,{"$f":"IF(Assessment!$E$133=1,1,IF(Assessment!$E$133=0.5,0.5,IF(Assessment!$E$133=0.75,0.5,0)))","v":0},{"$f":"IF(Assessment!$E$176=1,1,IF(Assessment!$E$176=0.5,0.5,IF(Assessment!$E$176=0.75,0.5,0)))","v":0},{"$f":"IF(Assessment!$E$221=1,1,IF(Assessment!$E$221=0.5,0.5,IF(Assessment!$E$221=0.75,0.5,0)))","v":0},null,null,{"$f":"IF(Assessment!$E$281=1,1,IF(Assessment!$E$281=0.5,0.5,IF(Assessment!$E$281=0.75,0.5,0)))","v":0},null,null,null,null,{"$f":"IF(Assessment!$E$371=1,1,IF(Assessment!$E$371=0.5,0.5,IF(Assessment!$E$371=0.75,0.5,0)))","v":0},{"$f":"IF(Assessment!$E$420=1,1,IF(Assessment!$E$420=0.5,0.5,IF(Assessment!$E$420=0.75,0.5,0)))","v":0}]
[8,{"$f":"IF(Assessment!$E$36=1,1,IF(Assessment!$E$36=0.5,0.5,IF(Assessment!$E$36=0.75,0.5,0)))","v":0},null,{"$f":"IF(Assessment!$E$137=1,1,IF(Assessment!$E$137=0.5,0.5,IF(Assessment!$E$137=0.75,0.5,0)))","v":0},{"$f":"IF(Assessment!$E$192=1,1,IF(Assessment!$E$192=0.5,0.5,IF(Assessment!$E$192=0.75,0.5,0)))","v":0},{"$f":"IF(Assessment!$E$226=1,1,IF(Assessment!$E$226=0.5,0.5,IF(Assessment!$E$226=0.75,0.5,0)))","v":0},null,null,{"$f":"IF(Assessment!$E$282=1,1,IF(Assessment!$E$282=0.5,0.5,IF(Assessment!$E$282=0.75,0.5,0)))","v":0},null,null,null,null,{"$f":"IF(Assessment!$E$372=1,1,IF(Assessment!$E$372=0.5,0.5,IF(Assessment!$E$372=0.75,0.5,0)))","v":0}]
[9,{"$f":"IF(Assessment!$E$39=1,1,IF(Assessment!$E$39=0.5,0.5,IF(Assessment!$E$39=0.75,0.5,0)))","v":0},null,{"$f":"IF(Assessment!$E$144=1,1,IF(Assessment!$E$144=0.5,0.5,IF(Assessment!$E$144=0.75,0.5,0)))","v":0},{"$f":"IF(Assessment!$E$196=1,1,IF(Assessment!$E$196=0.5,0.5,IF(Assessment!$E$196=0.75,0.5,0)))","v":0},{"$f":"IF(Assessment!$E$229=1,1,IF(Assessment!$E$229=0.5,0.5,IF(Assessment!$E$229=0.75,0.5,0)))","v":0},null,null,{"$f":"IF(Assessment!$E$283=1,1,IF(Assessment!$E$283=0.5,0.5,IF(Assessment!$E$283=0.75,0.5,0)))","v":0},null,null,null,null,{"$f":"IF(Assessment!$E$376=1,1,IF(Assessment!$E$376=0.5,0.5,IF(Assessment!$E$376=0.75,0.5,0)))","v":0}]
[10,{"$f":"IF(Assessment!$E$42=1,1,IF(Assessment!$E$42=0.5,0.5,IF(Assessment!$E$42=0.75,0.5,0)))","v":0},null,null,null,{"$f":"IF(Assessment!$E$230=1,1,IF(Assessment!$E$230=0.5,0.5,IF(Assessment!$E$230=0.75,0.5,0)))","v":0},null,null,null,null,null,null,null,{"$f":"IF(Assessment!$E$380=1,1,IF(Assessment!$E$380=0.5,0.5,IF(Assessment!$E$380=0.75,0.5,0)))","v":0}]
[11,{"$f":"IF(Assessment!$E$46=1,1,IF(Assessment!$E$46=0.5,0.5,IF(Assessment!$E$46=0.75,0.5,0)))","v":0},null,null,null,{"$f":"IF(Assessment!$E$233=1,1,IF(Assessment!$E$233=0.5,0.5,IF(Assessment!$E$233=0.75,0.5,0)))","v":0},null,null,null,null,null,null,null,{"$f":"IF(Assessment!$E$383=1,1,IF(Assessment!$E$383=0.5,0.5,IF(Assessment!$E$383=0.75,0.5,0)))","v":0}]
[12,{"$f":"IF(Assessment!$E$49=1,1,IF(Assessment!$E$49=0.5,0.5,IF(Assessment!$E$49=0.75,0.5,0)))","v":0},null,null,null,null,null,null,null,null,null,null,null,{"$f":"IF(Assessment!$E$384=1,1,IF(Assessment!$E$384=0.5,0.5,IF(Assessment!$E$384=0.75,0.5,0)))","v":0}]
[13,{"$f":"IF(Assessment!$E$54=1,1,IF(Assessment!$E$54=0.5,0.5,IF(Assessment!$E$54=0.75,0.5,0)))","v":0},null,null,null,null,null,null,null,null,null,null,null,{"$f":"IF(Assessment!$E$388=1,1,IF(Assessment!$E$388=0.5,0.5,IF(Assessment!$E$388=0.75,0.5,0)))","v":0}]
[14,{"$f":"IF(Assessment!$E$57=1,1,IF(Assessment!$E$57=0.5,0.5,IF(Assessment!$E$57=0.75,0.5,0)))","v":0},null,null,null,null,null,null,null,null,null,null,null,{"$f":"IF(Assessment!$E$391=1,1,IF(Assessment!$E$391=0.5,0.5,IF(Assessment!$E$391=0.75,0.5,0)))","v":0}]
[15,{"$f":"IF(Assessment!$E$60=1,1,IF(Assessment!$E$60=0.5,0.5,IF(Assessment!$E$60=0.75,0.5,0)))","v":0},null,null,null,null,null,null,null,null,null,null,null,{"$f":"IF(Assessment!$E$394=1,1,IF(Assessment!$E$394=0.5,0.5,IF(Assessment!$E$394=0.75,0.5,0)))","v":0}]
[16,{"$f":"IF(Assessment!$E$65=1,1,IF(Assessment!$E$65=0.5,0.5,IF(Assessment!$E$65=0.75,0.5,0)))","v":0},null,null,null,null,null,null,null,null,null,null,null,{"$f":"IF(Assessment!$E$395=1,1,IF(Assessment!$E$395=0.5,0.5,IF(Assessment!$E$395=0.75,0.5,0)))","v":0}]
[17,{"$f":"IF(Assessment!$E$68=1,1,IF(Assessment!$E$68=0.5,0.5,IF(Assessment!$E$68=0.75,0.5,0)))","v":0}]
[18,{"$f":"IF(Assessment!$E$71=1,1,IF(Assessment!$E$71=0.5,0.5,IF(Assessment!$E$71=0.75,0.5,0)))","v":0}]
{"$rows_left_out":5}