{"text_format":"1","workbook":"xlsx","n_sheets":6,"sheets":["How to Use","How to Score Yourself","Assessment Tool","Tool Mapped to Standards","Tool Mapped to Core Data Servic","Lookups"],"not_rendered":{"charts":0,"images":3,"macros":1,"external_links":0,"defined_names":5,"comments":0,"pivot_tables":0},"unopened":[],"bounds":{"document_bytes":16777216,"sheet_cells":100000,"rows_first":2000,"rows_last":500,"rows_between":2000,"halvings":0,"cell_chars":16384,"cell_head_chars":4096},"cells_cut":0,"cells_raw":0,"read":"whole","date_system":"1900"}

{"sheet":"How to Use","index":0,"n_rows":0,"n_cols":0,"rows_kept":0,"cut":false,"hidden":false,"merged":[]}

{"sheet":"How to Score Yourself","index":1,"n_rows":7,"n_cols":8,"rows_kept":7,"cut":false,"hidden":false,"merged":[[6,0,7,0],[6,4,7,4],[6,5,7,5],[6,6,7,6],[6,7,7,7],[6,2,7,2],[6,1,7,1]]}
[null,"ISO 21827:2008","Definitions","Original ISO text","EDUCAUSE Information Security Maturity Index (Core Data Service, Module 7)","CMMI","NIST","COBIT"]
[0,"Not Performed","There are no security controls or plans in place. The controls are nonexistent.",null,"Not Performed","Non-existent","Non-existent","Non-existent"]
[1,"Performed Informally","Base practices of the control area are generally performed on an ad hoc basis. There is general agreement within the organization that identified actions should be performed, and they are performed when required. The practices are not formally adopted, tracked, and reported on.","Base practices of the process area are generally performed. The performance of these base practices may not be rigorously planned and tracked. Performance depends on individual knowledge and effort. Work products of the process area testify to their performance. Individuals within the organization recognize that an action should be performed, and there is general agreement that this action is performed as and when required. There are identifiable work products for the process.","Absent/ad hoc","Initial","Policies","Initial/Ad-hoc"]
[2,"Planned","The base requirements for the control area are planned, implemented, and repeatable. ","Performance of the base practices in the process area is planned and tracked. Performance according to specified procedures is verified. Work products conform to specified standards and requirements.","Repeatable","Managed","Procedures  ","Repeatable but Intuitive"]
[3,"Well Defined","The primary distinction from Level 2, Planned and Tracked, is that in addition to being repeatable the processes used are more mature: documented, approved, and implemented organization-wide.","Base practices are performed according to a well-defined process using approved, tailored versions of standard, documented processes. The primary distinction from Level 2, Planned and Tracked, is that the process is planned and managed using an organization-wide standard process.","Defined","Defined","Implementation","Defined Process"]
[4,"Quantitatively Controlled","The primary distinction from Level 3, Well Defined, is that the process is measured and verified (e.g., auditable).","Detailed measures of performance are collected and analyzed. This leads to a quantitative understanding of process capability and an improved ability to predict performance. Performance is objectively managed, and the quality of work products is quantitatively known. The primary distinction from the Well Defined level is that the defined process is quantitatively understood and controlled.","Managed","Quantitatively Managed","Test","Managed & Measurable"]
[5,"Continuously Improving","The primary distinction from Level 4, Quantitatively Controlled, is that the defined, standard processes are regularly reviewed and updated. Improvements reflect an understanding of, and response to, a vulnerability's impact.","Quantitative performance goals (targets) for process effectiveness and efficiency are established based on the business goals of the organization. Continuous process improvement against these goals is enabled by quantitative feedback from performing the defined processes and from piloting innovative ideas and technologies. The primary distinction from the quantitatively controlled level is that the defined process and the standard process undergo continuous refinement and improvement, based on a quantitative understanding of the impact of changes to these processes.","Optimized","Optimized","Integration"," Optimized "]

{"sheet":"Assessment Tool","index":2,"n_rows":198,"n_cols":7,"rows_kept":198,"cut":false,"hidden":false,"merged":[[124,4,124,6],[14,4,14,6],[18,4,18,6],[22,4,22,6],[36,4,36,6],[30,4,30,6],[60,4,60,6],[68,4,68,6],[39,4,39,6],[96,4,96,6],[119,4,119,6],[122,4,122,6],[56,4,56,6],[89,4,89,6],[112,4,112,6]]}
[null,null,"This section is designed to help you benchmark your information security Program against universities of similar size, budget, and characteristics. "]
[null,null,"Annual budget of the organization\n"]
[null,null,"What is your institution's Carnegie designation?"]
[null,null,"Estimated annual budget for information security"]
[null,null,"Number of employees","2,100 to 3,000",null,null,"less than 1,000"]
[null,null,"Number of employees with information security role","1 to 5",null,null,0]
[null,null,"Number of students","10,000-20,000",null,null,"less than 5,000"]
[null,null,"Percentage of information security operations outsourced? (contractors, managed security services, cloud)","\n"]
[null,null,"Does your organization have academic or research programs in a sensitive area that may make you a target of physical or cyberattack from any groups (e.g., ITAR, human subjects, DoD-sponsored applied research, etc.)? ","no",null,null,"yes"]
[null,null,"This tool can be used to assess an enterprise information security program, department, or other.  Please select from the drop down box ->","Enterprise Information Security Program"]
[null,null,"Name of person completing assessment:"]
[null,null,"Name of department or institution (if applicable):"]
[null,null,"Date completed","Reset Worksheet ----->"]
["ISO Section Descriptions",null,"Questions","Not Performed = 0; Performed Informally = 1; \nPlanned = 2; Well Defined = 3; \nQuantitatively Controlled = 4; Continuously Improving = 5; Not Applicable = Blank\nNOTE: 5 is the highest level of maturity","Item Score","Category Score","Help"]
[null,null,"Risk Management (ISO 27005:2011)","Total Score for Risk Management ->",{"$f":"IFERROR(AVERAGE(E16:E18),\"\")","v":0}]
[null,1,"Does your institution have a risk management program? ","Not Performed",{"$f":"IF(D16=\"\",\"\",IF(D16=\"No\",0,IF(D16=\"Yes\",5)))","v":false},null,"\n\n\n"]
["Risk Management/Assessment & Treatment",2,"Does your institution have a process for identifying and assessing reasonably foreseeable internal and external risks to the security, confidentiality, and/or integrity of any electronic, paper, or other records containing sensitive information?","Not Performed",{"$f":"VLOOKUP(D17,Lookups!$A$2:$B$8,2,FALSE)","v":0}]
["Assessing Security Risks ",3,"Does your organization conduct routine risk assessments to identify the key objectives that need to be supported by your information security program? ","Not Performed",{"$f":"VLOOKUP(D18,Lookups!$A$2:$B$8,2,FALSE)","v":0}]
[null,null,"Information Security Policies (ISO 5)","Total Score for ISO 5->",{"$f":"IFERROR(AVERAGE(E20:E22),\"\")","v":0}]
[null,4,"Does your institution have an information security policy that has been approved by management?","Not Performed",{"$f":"VLOOKUP(D20,Lookups!$A$2:$B$8,2,FALSE)","v":0}]
["Information Security Policy Document",5,"Has it been published and communicated to all relevant parties? \n","Not Performed",{"$f":"VLOOKUP(D21,Lookups!$A$2:$B$8,2,FALSE)","v":0}]
["Review of Information Security Policy ",6,"Does your institution review the policy at defined intervals to encompass significant change and monitor for compliance?","Not Performed",{"$f":"VLOOKUP(D22,Lookups!$A$2:$B$8,2,FALSE)","v":0}]
[null,null,"Organization of Information Security (ISO 6) ","Total Score for ISO 6 ->",{"$f":"IFERROR(AVERAGE(E24:E30),\"\")","v":0}]
["Management Commitment to information security",7,"Does your information security function have the authority it needs to manage and ensure compliance with the information security program? ","Not Performed",{"$f":"VLOOKUP(D24,Lookups!$A$2:$B$8,2,FALSE)","v":0}]
["Information security Co-ordination",8,"Does your institution have an individual with enterprise-wide (campus) information security responsibility and authority written in their job description, or equivalent? Note: This may be the CIO, CISO, CSO, or other.","Not Performed",{"$f":"VLOOKUP(D25,Lookups!$A$2:$B$8,2,FALSE)","v":0}]
["Allocation of information security responsibilities ",9,"Is responsibility clearly assigned for all areas of the information security architecture, compliance, processes, and audits? ","Not Performed",{"$f":"VLOOKUP(D26,Lookups!$A$2:$B$8,2,FALSE)","v":0}]
["Authorization process for Information Processing facilities ",10,"Is there a formal process for having the individual with information security responsibility assess and sign off on appropriate hardware, software, and services, ensuring they follow security policies and requirements?","Not Performed",{"$f":"VLOOKUP(D27,Lookups!$A$2:$B$8,2,FALSE)","v":0}]
["Contact with authorities",11,"Does your institution maintain relationships with local authorities? \n","Not Performed",{"$f":"VLOOKUP(D28,Lookups!$A$2:$B$8,2,FALSE)","v":0}]
["Contact with special interest groups",12,"Does your institution participate with local or national security groups (e.g., REN-ISAC, EDUCAUSE, InfraGard, Information Systems Security Association, etc.)?","Not Performed",{"$f":"VLOOKUP(D29,Lookups!$A$2:$B$8,2,FALSE)","v":0}]
["Independent review of information security",13,"Does your institution have independent security reviews completed at planned intervals or when significant changes to the environment occur?","Not Performed",{"$f":"VLOOKUP(D30,Lookups!$A$2:$B$8,2,FALSE)","v":0}]
[null,null,"Human Resource Security (ISO 7)","Total Score for ISO 7 ->",{"$f":"IFERROR(AVERAGE(E32:E36),\"\")","v":0}]
["Management Responsibility",14,"Do all individuals interacting with university systems receive information security awareness training?","Not Performed",{"$f":"VLOOKUP(D32,Lookups!$A$2:$B$8,2,FALSE)","v":0}]
["Information security awareness, education and training",15,"Does your institution conduct specialized role-based training? \n","Not Performed",{"$f":"VLOOKUP(D33,Lookups!$A$2:$B$8,2,FALSE)","v":0}]
[null,16,"Do the information security programs clearly state responsibilities, liabilities, and consequences? ","Not Performed",{"$f":"VLOOKUP(D34,Lookups!$A$2:$B$8,2,FALSE)","v":0}]
["Termination responsibility",17,"Does your institution have a process for revoking system and building access and returning assigned assets? ","Not Performed",{"$f":"VLOOKUP(D35,Lookups!$A$2:$B$8,2,FALSE)","v":0}]
["Return of assets",18,"Does your institution have a process for revoking system access when there is a position change or when responsibilities change?","Not Performed",{"$f":"VLOOKUP(D36,Lookups!$A$2:$B$8,2,FALSE)","v":0}]
[null,null,"Asset Management (ISO 8) ","Total Score for ISO 8->",{"$f":"IFERROR(AVERAGE(E38:E39),\"\")","v":0}]
["Inventory of assets",19,"Has your organization identified critical information assets and the functions that rely on them? ","Not Performed",{"$f":"VLOOKUP(D38,Lookups!$A$2:$B$8,2,FALSE)","v":0}]
["Classification Guidelines",20,"Does your institution classify information to indicate the appropriate levels of information security? ","Not Performed",{"$f":"VLOOKUP(D39,Lookups!$A$2:$B$8,2,FALSE)","v":0}]
[null,null,"Access Control (ISO 9)","Total Score for ISO 9->",{"$f":"IFERROR(AVERAGE(E41:E56),\"\")","v":0}]
{"$rows_left_out":159}
{"sheet":"Tool Mapped to Standards","index":3,"n_rows":117,"n_cols":6,"rows_kept":117,"cut":false,"hidden":false,"merged":[]}
["Assessment Tool Question #","ISO 27002:2013","NIST SP 800-53 r4 Controls","NIST 800-171 r1 Controls","NIST Cybersecurity Framework","CIS 20 Critical Security Controls (ver 6.1)"]
["Risk Management (ISO 27005:2011)"]
[1,"No direct mapping, see ISO 27005 (risk management)","RA-1","3.11.1","ID.RM-1"]
[2,"No direct mapping, see ISO 27005 (risk management)","RA-2","3.11.1","ID.RM-1"]
[3,"No direct mapping, see ISO 27005 (risk management)","RA-3","3.11.1","ID.RM-1, ID.GV-4"]
["Information Security Policies (ISO 5)"]
[4,"5. Information Security Policies","PL Family",null,"ID.GV-1"]
[5,"5.1 Management direction for information security","PL Family",null,"ID.GV-1"]
[6,"5.1.1 Policies for information security","PL Family","3.12.4","ID.GV-1"]
["Organization of Information Security (ISO 6)"]
[7,"7.2.1 Management responsibilities","PM-2, PM-3, PM-9; SP 800-39,SP 800-37"]
[8,"Deleted from ISO 27002:2013","CP-2, CP-4, IR-4, PL-1, PL-2, PM-2, SA-2;SP 800-39, SP 800-37"]
[9,"6.1.1 Information security roles and responsibilities","AC-5, AC-6, CM-9, PM-2; SP 800-39, SP 800-37",null,"ID.AM-6; ID.GV-2"]
[10,"Deleted from ISO 27002:2013","CA-1, CA-6, PM-10; SP 800-37",null,"ID.AM-6"]
[11,"6.1.3 Contact with authorities","Multiple controls with contact reference (e.g.,IR-6, SI-5), SP 800-39; SP 800-37",null,"DE.DP-4, RS.CO-3, RS.CO-5"]
[12,"6.1.4 Contact with special interest groups","AT-5, SI-5",null,"RS.CO-5"]
[13,"18.2.1 Independent review of information security","CA-2, CA-7; SP 800-39, SP 800-37"]
["Human Resource Security (ISO 7)"]
[14,"7.2.2 Information security awareness, education and training","AT-2, AT-3, IR-2","3.2.1; 3.2.2","PR.AT-1","CSC 17"]
[15,"7.2.3 Disciplinary process","AT-3, PS-8",null,"PR.AT-2, PR.AT-3, PR.AT-4, PR.AT-5","CSC 17"]
[16,"7.3 Termination and change of employment","PS-4",null,"PR.AT-2, PR.AT-3, PR.AT-4, PR.AT-6"]
[17,"7.3.1 Termination or change of employment responsibilities\n8.1.4 Return of assets\n9.2.6 Removal or adjustment of access rights\n11.1 Secure areas\n11.1.1 Physical security perimeter","AC-2, PS-4, PS-5, PE-3",null,"PR.AC-4, PR.DS-3","CSC 16"]
[18,"11.1.2 Physical entry controls\n11.1.3 Securing offices, room and facilities","PE-3, PE-4, PE-5, PE-6",null,"PR.AC-4, PR.DS-3","CSC 16"]
["Asset Management (ISO 8)"]
[19,"8.1.1 Inventory of assets","CM-8, CM-9, PM-5","3.4.1","ID.AM-1, ID.AM-2","CSC 1 (devices), CSC 2 (software), CSC13 (data)"]
[20,"8.1.2 Ownership of assets","CM-8, CM-9, PM-5, AC-16, AC-20, PL-4, RA-2, MP-2, MP-3, SC-16","3.4.1","ID.AM-5","CSC 13"]
["Access Control (ISO 9)"]
[21,"9.1 Business requirements of access control","AC-1",3.1,"PR.AC-1, PR.AC-4"]
[22,"9.1.1 Access control policy\n9.2 User access management","AC-1, AC-3, AC-5, AC-6, AC-7, AC-9, AC-17, AC-18, AC-19, CM-5, MP-1, SI-9","3.1.1; 3.1.2; 3.1.4; 3.1.5","PR.AC-1, PR.AC-4","CSC 5, CSC 16"]
[23,"9.2.1 User registration and deregistration \n9.2.2 User access provisioning\n9.2.3 Management of privileged access rights","AC-1, AC-2, AC-6, AC-21, IA-5, PE-1, PE-2, SI-9","3.1.1; 3.1.2; 3.1.4; 3.1.5","PR.AC-1, PR.AC-4","CSC 5"]
[24,"9.2.4 Management of secret authentication information of users","AC-6, IA-5",null,"PR.AC-4","CSC 5"]
[25,"9.2.5 Review of user access rights\n9.3 User responsibilities\n9.3.1 Use of secret authentication information\n11.2.8 Unattended user equipment\n11.2.9 Clear desk and clear screen policy\n13. Communications security\n9.1.2 Access to networks and network services","AC-1, AC-2, AC-5, AC-6, AC-11, AC-17, AC-18, AC-20, IA-2, IA-5m PE-2  PE-3, PE-5, PE-18, SC-10, MP-4","3.1.1; 3.1.2; 3.1.4; 3.1.5","PR.AC-3","CSC 3"]
[26,"Deleted from ISO 27002:2013","AC-3, AC-6, AC-17, AC-18, SC-7",null,"PR.DS-5"]
[27,"9.4 System and application access control","AC-4, AC-17, AC-18",null,"PR.DS-6","CSC 5, CSC 16"]
[28,"9.4.2 Secure log-on procedures","AC-7, AC-8, AC-9, AC-10, IA-2, IA-6, IA-8, SC-10","3.1.8",null,"CSC 16"]
[29,"9.2.1 User registration and deregistration\n9.2.2 User access provisioning","IA-2, IA-4, IA-5, IA-8",null,"PR.AC-1, PR.AC-4","CSC 5"]
[30,"9.1.1 Access control policy\n9.2 User access management\n9.2.3 Management of privileged access rights","AC-5, AC-24","3.1.4; 3.1.5; 3.1.6; 3.1.7; 3.5.3",null,"CSC 5"]
[31,"9.4.3 Password management system","IA-2, IA-5","3.5.5",null,"CSC 16"]
[32,"9.4.2 Secure log-on procedures \n9.4.4 Use of privileged utility programs","AC-2, AC-3, AC-6, AC-11, AC-14, CM-5, SC-10","3.1.6; 3.1.7; 3.1.8; 3.4.5",null,"CSC 13"]
[33,"9.4.1 Information access restriction \n6.2 Mobile devices and teleworking","AC-19, SC-7; SP 800-39"]
{"$rows_left_out":78}
{"sheet":"Tool Mapped to Core Data Servic","index":4,"n_rows":117,"n_cols":5,"rows_kept":117,"cut":false,"hidden":false,"merged":[]}
["Assessment Tool Question #","EDUCAUSE Core Data Service Benchmark Data Cross Reference (2016 CDS)","Included in CDS Information Security Maturity Index Question (2016 Infosec Module, Q5)","EDUCAUSE Core Data Service Benchmark Data Cross Reference (2015 CDS)","Included in CDS Information Security Maturity Index Question (M7Q5) (2015 CDS)"]
["Risk Management (ISO 27005:2011)"]
[1,"Capability & Deployment Module Q4",null,"M1Q6.c; M1Q14"]
[2,"Capability & Deployment Module Q4",3.1,"M1Q14","Sec 3.1"]
[3,"Capability and Deployment Module Q4\nInfoSec Module Q8-9",null,"M1Q1.b; M7Q8-9"]
["Information Security Policies (ISO 5)"]
[4,"InfoSec Module Q1.f",1.8,"M1Q12; M7Q1.f; M7Q10","Sec 2.1"]
[5,"InfoSec Module Q1.f",null,"M1Q12; M7Q1.f; M7Q10"]
[6,"InfoSec Module Q1.f",null,"M1Q12; M7Q1.f; M7Q10"]
["Organization of Information Security (ISO 6)"]
[7]
[8,"InfoSec Module Q2-4",1.1000000000000001,"M7Q4","Sec 1.1"]
[9,"InfoSec Module Q1.a",null,"M7Q1.a; M7Q4"]
[10,"InfoSec Module Q1.k",null,"M7Q1.k"]
[11,null,1.7]
[12,"InfoSec Module Q10",1.4,null,"Sec 1.4"]
[13,"InfoSec Module Q8-9","3.7; 3.8",null,"Sec 5.7, sec 5.8"]
["Human Resource Security (ISO 7)"]
[14,"InfoSec Module Q1.e",1.3,"M7Q5 (sec 1.3); M7Q10","Sec 1.3"]
[15,null,null,"M7Q10"]
[16]
[17,null,"2.7; 2.8",null,"Sec 4.2"]
[18,null,"2.7; 2.9"]
["Asset Management (ISO 8)"]
[19,null,4.3,null,"Sec 3.2"]
[20,null,4.4000000000000004,null,"Sec 3.3"]
["Access Control (ISO 9)"]
[21,"InfoSec Module Q13-15","2.7; 2.9","M1Q12; M5Q12","Sec 4.1"]
[22,"InfoSec Module Q13-15","2.7; 2.9","M1Q12; M7Q6.h; M7Q6.n; M7Q6.o"]
[23,null,null,"See generally M2Q8.a"]
[24,null,2.9,null,"Sec 4.3"]
[25,"InfoSec Module Q13-14",null,"M7Q6.n"]
[26,"See generally InfoSec Module Q6 re security technology deployment",null,"See generally M7Q6 re security technology deployment"]
[27,"InfoSec Module Q15",6.1,"See generally M7Q14"]
[28]
[29]
[30,"InfoSec Module Q13-14"]
[31,null,"2.10; 2.11",null,"Sec 4.4"]
[32,null,2.4,null,"Sec 3.4, Sec 3.5"]
[33,null,4.0999999999999996,null,"Sec 2.4"]
{"$rows_left_out":78}
{"sheet":"Lookups","index":5,"n_rows":8,"n_cols":2,"rows_kept":8,"cut":false,"hidden":false,"merged":[]}
["Description","Value"]
["Not Performed",0]
["Performed Informally",1]
["Planned",2]
["Well Defined",3]
["Quantitatively Controlled",4]
["Continuously Improving",5]
["Not Applicable","Blank"]